[gambit-list] Error building 4.6.7

Steve Graham jsgrahamus at yahoo.com
Wed Feb 20 11:41:10 EST 2013

Also getting an error during the make bootstrap step applied to the git downloaded version:
gcc -Wno-unused -Wno-write-strings -O2 -fno-math-errno -fschedule-insns2 -fno-trapping-math -fno-strict-aliasing -fwrapv -fmodulo-sched -freschedule-modulo-sche:_io.c:2658:1: error: ‘___SYMCOUNT’ undeclared here (not in a function)
_io.c:3199:1: error: ‘___KEYCOUNT’ undeclared here (not in a function)
_io.c:4172:2: error: ‘___REF_KEY_OBJ’ undeclared here (not in a function)
_io.c: In function ‘___H__20___io’:
_io.c:12054:1: error: ‘___lp’ undeclared (first use in this function)

 From: Steve Graham <jsgrahamus at yahoo.com>
To: Gambit List <Gambit-list at iro.umontreal.ca> 
Sent: Wednesday, February 20, 2013 9:23 AM
Subject: [gambit-list] Error building 4.6.7

Just downloaded 4.6.7 to my Linux Mint 14 (x64) system.

In following the quick installation instructions in README, I got an error in the make step:

../gsc-boot -:~~bin=../bin,~~lib=../lib,~~include=../include -f -c  -check _t-c-3.scm
*** ERROR -- Can't find file "/usr/lib/gambc-v4_6_7-devel/gsc/_t-c-3.scm"
make[1]: *** [_t-c-3.c] Error 70
make[1]: Leaving directory `/usr/lib/gambc-v4_6_7-devel/gsc'
make: *** [all-recursive] Error 1
steve at steve-Satellite-L555D /usr/lib/gambc-v4_6_7-devel $ 

The odd thing is that the file does exist:

steve at steve-Satellite-L555D /usr/lib/gambc-v4_6_7-devel $ cd gsc
steve at steve-Satellite-L555D /usr/lib/gambc-v4_6_7-devel/gsc $ ls -al _t-c-3.scm
-rw------- 1 501 501 13399 Jun 14  2012 _t-c-3.scm
steve at steve-Satellite-L555D /usr/lib/gambc-v4_6_7-devel/gsc $


Gambit-list mailing list
Gambit-list at iro.umontreal.ca
-------------- next part --------------
An HTML attachment was scrubbed...
URL: <http://mailman.iro.umontreal.ca/pipermail/gambit-list/attachments/20130220/6cb5c0ee/attachment.htm>

More information about the Gambit-list mailing list